{"text_format":"1","workbook":"xlsx","n_sheets":5,"sheets":["Welcome","OtherTables","MasterSheet","RTE_State_Rules_Matrix","Credits"],"not_rendered":{"charts":0,"images":2,"macros":1,"external_links":0,"defined_names":0,"comments":1,"pivot_tables":0},"unopened":[],"bounds":{"document_bytes":16777216,"sheet_cells":100000,"rows_first":2000,"rows_last":500,"rows_between":2000,"halvings":0,"cell_chars":16384,"cell_head_chars":4096},"cells_cut":0,"cells_raw":0,"read":"whole","date_system":"1900"}

{"sheet":"Welcome","index":0,"n_rows":17,"n_cols":3,"rows_kept":17,"cut":false,"hidden":false,"merged":[]}
[]
[]
[null,null,"Welcome to RTE State Rules Matrix"]
[null,null,"A CCS Presentation"]
[]
[]
[]
[]
{"$rows_left_out":10}
{"sheet":"OtherTables","index":1,"n_rows":42,"n_cols":20,"rows_kept":42,"cut":false,"hidden":true,"merged":[[3,15,3,16],[1,1,1,2],[1,4,1,11]]}
[]
[null,"Category sub-Category Table",null,null,"Data Sources Table"]
[null,"Category","Sub-Category",null,null,"25% Reservation","Neighbourhood Criteria","School Recognition","School Management Committees","Quality of Education","Authorities","Disability",null,null,"Andhra Pradesh","Meghalaya","Learning Outcomes",null,"Meeting of the neighbourhood criteria",1]
[null,"25% Reservation","EWS Criterion",null,"Andhra Pradesh","Andhra Pradesh RTE Rules","Andhra Pradesh RTE Rules","Andhra Pradesh RTE Rules","Andhra Pradesh RTE Rules","Andhra Pradesh RTE Rules","Andhra Pradesh RTE Rules","Andhra Pradesh RTE Rules",null,null,"Arunachal Pradesh",{"$f":"HLOOKUP(P3,#REF!,MATCH(Q3,#REF!,0)+1,FALSE)","v":{"$error":"#REF!"}},null,null,"25% Reservation for children in pvt schools",2]
[null,"25% Reservation","Disadvantaged Group Criterion",null,"Arunachal Pradesh","Arunachal Pradesh RTE Rules","Arunachal Pradesh RTE Rules","Arunachal Pradesh RTE Rules","Arunachal Pradesh RTE Rules","Arunachal Pradesh RTE Rules","Arunachal Pradesh RTE Rules","Arunachal Pradesh RTE Rules",null,null,"Assam",null,null,null,"School Recognition",3]
[null,"25% Reservation","Pre-School Education",null,"Assam","Assam RTE Rules","Assam RTE Rules","Assam RTE Rules","Assam RTE Rules","Assam RTE Rules","Assam RTE Rules","Assam RTE Rules",null,null,"Bihar",null,null,null,"School Management Committees",4]
[null,"25% Reservation","Frequency of Calculation of\nPer-child Cost",null,"Bihar","Bihar RTE Rules","Bihar RTE Rules","Bihar RTE Rules","Bihar RTE Rules","Bihar RTE Rules","Bihar RTE Rules","Bihar RTE Rules",null,null,"Chhattisgarh",null,null,null,"Learning Outcomes",5]
[null,"25% Reservation","Per-child Cost per year in Rupees",null,"Chhattisgarh","Chhattisgarh RTE Rules","Chhattisgarh RTE Rules","Chhattisgarh RTE Rules","Chhattisgarh RTE Rules","Chhattisgarh RTE Rules","PIB Release: http://pib.nic.in/newsite/erelease.aspx?relid=71432","Chhattisgarh RTE Rules",null,null,"Delhi",null,null,null,"Teachers",6]
{"$rows_left_out":35}
{"sheet":"MasterSheet","index":2,"n_rows":31,"n_cols":43,"rows_kept":31,"cut":false,"hidden":true,"merged":[[0,40,0,42],[0,34,0,36],[0,37,0,39],[0,1,0,13],[0,20,0,21],[0,22,0,33],[0,14,0,19]]}
["Criterion/State","RTE Section 12",null,null,null,null,null,null,null,null,null,null,null,null,"Neighbourhood Criterion",null,null,null,null,null,"School Recognition",null,"School Management Committees",null,null,null,null,null,null,null,null,null,null,null,"Quality of Education",null,null,"Authorities",null,null,"Disability"]
[null,"EWS Criterion","Disadvantaged Group Criterion","Pre-School Education","Frequency of Calculation of\nPer-child Cost","Per-child Cost per year in Rupees","Document Proof for EWS/Disadvantaged","Payment Schedule","Payment Condition","Neighbourhood Criterion","Procedure of Admission","Special Entitlements for Disabled","Entitlements","Misc","Class I-V\n(Distance\nin km)","Class VI-VIII\n(Distance\n in km)","Disabled","Proof of Residence Documents","Proof of Age Documents (other than a Birth Certificate)","Criterion under 25% Reservation","Recognition Criterion","Misc/Other","Structure","Composition","Reservation for Women","Reservation for EWS/Disadvantaged Group","Reservation for\nParents/Guardian","Reservation for Children","Reservation for Local Representatives","Reservation for Teachers","Special Invitee","Chairperson/Convener","Special Duties","Other/Misc","Learning Outcomes","Remedial Measures","Other","State Advisory\nCouncil","REPA","SCPCR","Neighbourhood Criterion for Disabled","Special Entitlements","Teacher Training"]
["Andhra Pradesh","Annual Income of parents\n< Rs. 60,000 of:\na) Backward Classes \nb) Minorities\nc) Other classes","a) SC\nb) ST\nc) Orphans\nd) Migrant and Street Children\ne) Children with Special Needs\nf) HIV affected/infected children","No Mention","Every year in December","-","No Mention","Payment through RTGS/NEFT\nIst Instalment: 50%\nin September\n2nd Instalment: 50% in\nJanuary","Verification of Enrolment\nby DEO, Minimum Attendance of kids @ 80%\nevery month,student\nlearning outcomes\n","Same as Govt. Schools","No Mention","No Mention","Free text books,\nOne Notebook per subject,\nOther Writing Material,\nMid-day meals,\nUniforms ","Priority in Admission under Section 12-\nDisadvantaged Groups: 19%\na) Orphanse, HIV,\nDisabled: 5%\nb) SC: 10%\nc) ST: 4%\nWeaker Sections: 6%","0-1","0-3","Transportation,\nFor Severe Disability - Home Based Education","a) Ration Card\nb) Pattadar Pass Book\nc) Electricity Bill\nd) House Tax Receipt\ne) Telephone Bill","1) Hospital/ANM\n2) Anganwadi Record\n3) Self-declaration\nby parent/guardian","Same as Govt. Schools","Infrastructure based only as per the Schedule of the Act.","Dedicated Website for Recognition system.","Single Committee","27 Members","No Mention","One each for SC/ST/OBC/Muslim Minority from each each class","24 out of 27 members","Two Children and one of them may be a girl child","a) Corporator/Counselor in urban areas.\nb) One member from ward of Gram Panchayat incharge of education  ","No Mention","Eminent Educationist/Philanthropist","1) Chairperson - Sarpanch in Rural Areas,\nCorporator in Urban Areas.\n2) Member-Convener- Head Teacher\n","1) Arrange to demonstrate learning outcomes in reading, writing, arithmetic and comprehension,\nreduce teacher and student absenteeism\n2) Can hire teachers temporarily in case of delay in filling of vacancies.","Reservation for Parents/Guardian of child securing highest and lowest marks in all classes.","a) Payment  under section 12 has been conditioned on Learning Outcomes.\nb) SMC will do randomised testing of reading, writing, arithmetic and comprehension","No Mention","-","NA","NA","NA","a) Free transport\nb) Home based education in case of severe disability","Special Material, Uniforms and Books","All regular teachers to be trained in teaching methods for Child with Special Needs"]
["Arunachal Pradesh","Annual Income of Parents/Guardian less than the minimum limit specified in BPL families by the State govt.","NA","Provisions of 25% reservation shall apply to pre-primary classes wherever applicable.","No Mention","NA","NA","No Mention","No Mention","Same as Govt. Schools.\nRelaxation in case seats are not getting filled.","No Mention","Free special learning and support material","Free textbooks, writing materials and uniforms","-","0-1","0-3","Appropriate and safe transport arrangements by govt./local auth","No Mention","1) Hospital/ANM\n2) Anganwadi Record\n3) Self-declaration by parent/guardian","Same as Govt. Schools.\nRelaxation in case seats are not getting filled.","Infrastructure based requirements only.","-","Single Committee","No Mention","No Mention","No Mention","75%","8.33% from among local educationists/children, To be decided by Parents","8.33%, To be decided by local authority","8.33%, to be decided by teachers","NA","1) Chairperson - Parent,\n2) Member-Convener - Head Teacher","No Mention","-","SCERT shall design and implement a process of school quality assessment on a regular basis.","Special Training for children identified by SMC/Local Authority","-","NA","NA","NA","Appropriate and safe transport arrangements by govt./local auth","Free special learning and support material","No Mention"]
["Assam","NA","NA","No Mention","No Mention","NA","No Mention","1st Instalment (50%): September\n2nd Instalment (50%): January","No Mention","Same as Govt. Schools.\nRelaxation in case seats are not getting filled.","No Mention","Special Learning and Support Material.","Free textbooks,\nLearning Materials,\nUniforms","-","0-1","0-3","Transportation Arrangements","No Mention","1) Anganwadi Record\n2) Horoscope\n3) Certificate issued by villa headman (Gaon-Burha)\n4) Self-declaration\nby parent/guardian","Same as Govt. Schools.\nRelaxation in case seats are not getting filled.","Infrastructure based only as per the Schedule of the Act.","-","Single Committee","No Mention","50%","3 among 9 members among Parents","9 members","No Mention","One member from among Gaonburah/village headman/Community Nominee","One member from among teachers/local health workers/anganwadi workers","Two educationists/senior citizens as advisors","President - Parents\nMember-Secretary- Head teacher\n","1) Salaries of teaching/non-teaching staff shall be determined on the basis of strength of absentee statement approved by SMC which will monitor teacher attendance (left early/came late).\n2) Application for casual leave to be accepted by Dy. Inspector of Schools/BEO unless endorsed by SMC.","Very detailed procedures for election of members, conduct of business during meetings etc.","No Mention","Special Training for children identified by SMC/Local Authority","-","NA","NA","Constituted on Mar 4, 2010 vide\nNotification No. SWD 79/93/Pt. V/136-A ","Transportation Arrangements","Special learning and support material","No Mention"]
["Bihar","Work in Progress","Work in Progress","Work in Progress","Work in Progress","Work in Progress","Work in Progress","Work in Progress","Work in Progress","Work in Progress","Work in Progress","Work in Progress","Work in Progress","Work in Progress","Work in Progress","Work in Progress","Work in Progress","Work in Progress","Work in Progress","Work in Progress","Work in Progress","Work in Progress","Work in Progress","Work in Progress","Work in Progress","Work in Progress","Work in Progress","Work in Progress","Work in Progress","Work in Progress","Work in Progress","Work in Progress","Work in Progress","Work in Progress","Work in Progress","Work in Progress","Work in Progress","NA","NA","Constituted on Dec 23, 2008\nvide Notification No. ज्ञापांक-10/प्र0 गृ0स्था0 -16/ 2006-2028","Work in Progress","Work in Progress","Work in Progress"]
["Chhattisgarh","Work in Progress","Work in Progress","Work in Progress","Work in Progress","Work in Progress","Work in Progress","Work in Progress","Work in Progress","Work in Progress","Work in Progress","Work in Progress","Work in Progress","Work in Progress","Work in Progress","Work in Progress","Work in Progress","Work in Progress","Work in Progress","Work in Progress","Work in Progress","Work in Progress","Work in Progress","Work in Progress","Work in Progress","Work in Progress","Work in Progress","Work in Progress","Work in Progress","Work in Progress","Work in Progress","Work in Progress","Work in Progress","Work in Progress","Work in Progress","Work in Progress","Work in Progress","NA","NA","SCPCR constituted","Work in Progress","Work in Progress","Work in Progress"]
["Delhi","Annual Income of parents < Rs. 1 Lakh and a resident of Delhi since the last three years.","a) SC\nb) ST\nc) OBC (non creamy)\nd) Disabled\ne) Orphan","Provisions of 25% reservation shall apply to all three classes- Pre-nursery, LKG, UKG","Every year in December",14280,"a) Income Certificate issued by revenue officer\nb) BPL Card (yellow), AAY Card (pink)","No Mention","No Mention","Same as Govt. Schools.\nRelaxation in case seats are not getting filled.","Draw of lots. Procedure to be videographed.","free special learning and support material","free text books, writing materials and uniforms ","25% Reservation applicable to all three classes- Pre-nursery, LKG, UKG","0-1","0-3","Free Transportation","a) Ration Card\nb) Domicile Certificate of Child/Parent\nc) Voter ID\nd) Passport\ne) Electricity Bill\nf) Telephone Bill\ng) Water Bill","1) Hospital/ANM\n2) Anganwadi Record\n3) Self-declaration by parent/guardian","Same as Govt. Schools.\nRelaxation in case seats are not getting filled.","Infrastructure based only as per the Schedule of the Act.","-","Single Committee","16 Members","50%","Proportionate representation","75%","No Mention","One Member","1  - Teacher,\n1  - Head of the school","1 - Social Science Teacher\n1 - Science Teacher\n1- Maths Teacher","Chairperson - School Principal (ex-officio)","No Mention","-","No mention","No Mention","-","NA","NA","Constituted on Sep 8, 2008","Free Transport","Free special learning and support material","No Mention"]
{"$rows_left_out":24}
{"sheet":"RTE_State_Rules_Matrix","index":3,"n_rows":32,"n_cols":15,"rows_kept":32,"cut":false,"hidden":true,"merged":[]}
[]
[null,"Category"]
[null,"Sub-Category ","EWS Criterion","Disadvantaged Group Criterion","Pre-School Education","Frequency of Calculation of\nPer-child Cost","Per-child Cost per year in Rupees","Document Proof for EWS/Disadvantaged","Payment Schedule","Payment Condition","Neighbourhood Criterion","Procedure of Admission","Special Entitlements for Disabled","Entitlements","Misc"]
[1,"Andhra Pradesh",{"$f":"HLOOKUP(\"EWS Criterion\",MasterSheet!B2:AQ31,MATCH(B4,MasterSheet!A3:A31,0)+1,FALSE)","v":"Annual Income of parents\n< Rs. 60,000 of:\na) Backward Classes \nb) Minorities\nc) Other classes"},{"$f":"HLOOKUP(\"Disadvantaged Group Criterion\",MasterSheet!B2:AQ31,MATCH(B4,MasterSheet!A3:A31,0)+1,FALSE)","v":"a) SC\nb) ST\nc) Orphans\nd) Migrant and Street Children\ne) Children with Special Needs\nf) HIV affected/infected children"},{"$f":"HLOOKUP(\"Pre-School Education\",MasterSheet!B2:AQ31,MATCH(B4,MasterSheet!A3:A31,0)+1,FALSE)","v":"No Mention"},{"$f":"HLOOKUP(\"Frequency of Calculation of\nPer-child Cost\",MasterSheet!B2:AQ31,MATCH(B4,MasterSheet!A3:A31,0)+1,FALSE)","v":"Every year in December"},{"$f":"HLOOKUP(\"Per-child Cost per year in Rupees\",MasterSheet!B2:AQ31,MATCH(B4,MasterSheet!A3:A31,0)+1,FALSE)","v":"-"},{"$f":"HLOOKUP(\"Document Proof for EWS/Disadvantaged\",MasterSheet!B2:AQ31,MATCH(B4,MasterSheet!A3:A31,0)+1,FALSE)","v":"No Mention"},{"$f":"HLOOKUP(\"Payment Schedule\",MasterSheet!B2:AQ31,MATCH(B4,MasterSheet!A3:A31,0)+1,FALSE)","v":"Payment through RTGS/NEFT\nIst Instalment: 50%\nin September\n2nd Instalment: 50% in\nJanuary"},{"$f":"HLOOKUP(\"Payment Condition\",MasterSheet!B2:AQ31,MATCH(B4,MasterSheet!A3:A31,0)+1,FALSE)","v":"Verification of Enrolment\nby DEO, Minimum Attendance of kids @ 80%\nevery month,student\nlearning outcomes\n"},{"$f":"HLOOKUP(\"Neighbourhood Criterion\",MasterSheet!B2:AQ31,MATCH(B4,MasterSheet!A3:A31,0)+1,FALSE)","v":"Same as Govt. Schools"},{"$f":"HLOOKUP(\"Procedure of Admission\",MasterSheet!B2:AQ31,MATCH(B4,MasterSheet!A3:A31,0)+1,FALSE)","v":"No Mention"},{"$f":"HLOOKUP(\"Special Entitlements for Disabled\",MasterSheet!B2:AQ31,MATCH(B4,MasterSheet!A3:A31,0)+1,FALSE)","v":"No Mention"},{"$f":"HLOOKUP(\"Entitlements\",MasterSheet!B2:AQ31,MATCH(B4,MasterSheet!A3:A31,0)+1,FALSE)","v":"Free text books,\nOne Notebook per subject,\nOther Writing Material,\nMid-day meals,\nUniforms "},{"$f":"HLOOKUP(\"Misc\",MasterSheet!B2:AQ31,MATCH(B4,MasterSheet!A3:A31,0)+1,FALSE)","v":"Priority in Admission under Section 12-\nDisadvantaged Groups: 19%\na) Orphanse, HIV,\nDisabled: 5%\nb) SC: 10%\nc) ST: 4%\nWeaker Sections: 6%"}]
[2,"Arunachal Pradesh",{"$f":"HLOOKUP(\"EWS Criterion\",MasterSheet!B2:AQ31,MATCH(B5,MasterSheet!A3:A31,0)+1,FALSE)","v":"Annual Income of Parents/Guardian less than the minimum limit specified in BPL families by the State govt."},{"$f":"HLOOKUP(\"Disadvantaged Group Criterion\",MasterSheet!B2:AQ31,MATCH(B5,MasterSheet!A3:A31,0)+1,FALSE)","v":"NA"},{"$f":"HLOOKUP(\"Pre-School Education\",MasterSheet!B2:AQ31,MATCH(B5,MasterSheet!A3:A31,0)+1,FALSE)","v":"Provisions of 25% reservation shall apply to pre-primary classes wherever applicable."},{"$f":"HLOOKUP(\"Frequency of Calculation of\nPer-child Cost\",MasterSheet!B2:AQ31,MATCH(B5,MasterSheet!A3:A31,0)+1,FALSE)","v":"No Mention"},{"$f":"HLOOKUP(\"Per-child Cost per year in Rupees\",MasterSheet!B2:AQ31,MATCH(B5,MasterSheet!A3:A31,0)+1,FALSE)","v":"NA"},{"$f":"HLOOKUP(\"Document Proof for EWS/Disadvantaged\",MasterSheet!B2:AQ31,MATCH(B5,MasterSheet!A3:A31,0)+1,FALSE)","v":"NA"},{"$f":"HLOOKUP(\"Payment Schedule\",MasterSheet!B2:AQ31,MATCH(B5,MasterSheet!A3:A31,0)+1,FALSE)","v":"No Mention"},{"$f":"HLOOKUP(\"Payment Condition\",MasterSheet!B2:AQ31,MATCH(B5,MasterSheet!A3:A31,0)+1,FALSE)","v":"No Mention"},{"$f":"HLOOKUP(\"Neighbourhood Criterion\",MasterSheet!B2:AQ31,MATCH(B5,MasterSheet!A3:A31,0)+1,FALSE)","v":"Same as Govt. Schools.\nRelaxation in case seats are not getting filled."},{"$f":"HLOOKUP(\"Procedure of Admission\",MasterSheet!B2:AQ31,MATCH(B5,MasterSheet!A3:A31,0)+1,FALSE)","v":"No Mention"},{"$f":"HLOOKUP(\"Special Entitlements for Disabled\",MasterSheet!B2:AQ31,MATCH(B5,MasterSheet!A3:A31,0)+1,FALSE)","v":"Free special learning and support material"},{"$f":"HLOOKUP(\"Entitlements\",MasterSheet!B2:AQ31,MATCH(B5,MasterSheet!A3:A31,0)+1,FALSE)","v":"Free textbooks, writing materials and uniforms"},{"$f":"HLOOKUP(\"Misc\",MasterSheet!B2:AQ31,MATCH(B5,MasterSheet!A3:A31,0)+1,FALSE)","v":"-"}]
[3,"Assam",{"$f":"HLOOKUP(\"EWS Criterion\",MasterSheet!B2:AQ31,MATCH(B6,MasterSheet!A3:A31,0)+1,FALSE)","v":"NA"},{"$f":"HLOOKUP(\"Disadvantaged Group Criterion\",MasterSheet!B2:AQ31,MATCH(B6,MasterSheet!A3:A31,0)+1,FALSE)","v":"NA"},{"$f":"HLOOKUP(\"Pre-School Education\",MasterSheet!B2:AQ31,MATCH(B6,MasterSheet!A3:A31,0)+1,FALSE)","v":"No Mention"},{"$f":"HLOOKUP(\"Frequency of Calculation of\nPer-child Cost\",MasterSheet!B2:AQ31,MATCH(B6,MasterSheet!A3:A31,0)+1,FALSE)","v":"No Mention"},{"$f":"HLOOKUP(\"Per-child Cost per year in Rupees\",MasterSheet!B2:AQ31,MATCH(B6,MasterSheet!A3:A31,0)+1,FALSE)","v":"NA"},{"$f":"HLOOKUP(\"Document Proof for EWS/Disadvantaged\",MasterSheet!B2:AQ31,MATCH(B6,MasterSheet!A3:A31,0)+1,FALSE)","v":"No Mention"},{"$f":"HLOOKUP(\"Payment Schedule\",MasterSheet!B2:AQ31,MATCH(B6,MasterSheet!A3:A31,0)+1,FALSE)","v":"1st Instalment (50%): September\n2nd Instalment (50%): January"},{"$f":"HLOOKUP(\"Payment Condition\",MasterSheet!B2:AQ31,MATCH(B6,MasterSheet!A3:A31,0)+1,FALSE)","v":"No Mention"},{"$f":"HLOOKUP(\"Neighbourhood Criterion\",MasterSheet!B2:AQ31,MATCH(B6,MasterSheet!A3:A31,0)+1,FALSE)","v":"Same as Govt. Schools.\nRelaxation in case seats are not getting filled."},{"$f":"HLOOKUP(\"Procedure of Admission\",MasterSheet!B2:AQ31,MATCH(B6,MasterSheet!A3:A31,0)+1,FALSE)","v":"No Mention"},{"$f":"HLOOKUP(\"Special Entitlements for Disabled\",MasterSheet!B2:AQ31,MATCH(B6,MasterSheet!A3:A31,0)+1,FALSE)","v":"Special Learning and Support Material."},{"$f":"HLOOKUP(\"Entitlements\",MasterSheet!B2:AQ31,MATCH(B6,MasterSheet!A3:A31,0)+1,FALSE)","v":"Free textbooks,\nLearning Materials,\nUniforms"},{"$f":"HLOOKUP(\"Misc\",MasterSheet!B2:AQ31,MATCH(B6,MasterSheet!A3:A31,0)+1,FALSE)","v":"-"}]
[4,"Bihar",{"$f":"HLOOKUP(\"EWS Criterion\",MasterSheet!B2:AQ31,MATCH(B7,MasterSheet!A3:A31,0)+1,FALSE)","v":"Work in Progress"},{"$f":"HLOOKUP(\"Disadvantaged Group Criterion\",MasterSheet!B2:AQ31,MATCH(B7,MasterSheet!A3:A31,0)+1,FALSE)","v":"Work in Progress"},{"$f":"HLOOKUP(\"Pre-School Education\",MasterSheet!B2:AQ31,MATCH(B7,MasterSheet!A3:A31,0)+1,FALSE)","v":"Work in Progress"},{"$f":"HLOOKUP(\"Frequency of Calculation of\nPer-child Cost\",MasterSheet!B2:AQ31,MATCH(B7,MasterSheet!A3:A31,0)+1,FALSE)","v":"Work in Progress"},{"$f":"HLOOKUP(\"Per-child Cost per year in Rupees\",MasterSheet!B2:AQ31,MATCH(B7,MasterSheet!A3:A31,0)+1,FALSE)","v":"Work in Progress"},{"$f":"HLOOKUP(\"Document Proof for EWS/Disadvantaged\",MasterSheet!B2:AQ31,MATCH(B7,MasterSheet!A3:A31,0)+1,FALSE)","v":"Work in Progress"},{"$f":"HLOOKUP(\"Payment Schedule\",MasterSheet!B2:AQ31,MATCH(B7,MasterSheet!A3:A31,0)+1,FALSE)","v":"Work in Progress"},{"$f":"HLOOKUP(\"Payment Condition\",MasterSheet!B2:AQ31,MATCH(B7,MasterSheet!A3:A31,0)+1,FALSE)","v":"Work in Progress"},{"$f":"HLOOKUP(\"Neighbourhood Criterion\",MasterSheet!B2:AQ31,MATCH(B7,MasterSheet!A3:A31,0)+1,FALSE)","v":"Work in Progress"},{"$f":"HLOOKUP(\"Procedure of Admission\",MasterSheet!B2:AQ31,MATCH(B7,MasterSheet!A3:A31,0)+1,FALSE)","v":"Work in Progress"},{"$f":"HLOOKUP(\"Special Entitlements for Disabled\",MasterSheet!B2:AQ31,MATCH(B7,MasterSheet!A3:A31,0)+1,FALSE)","v":"Work in Progress"},{"$f":"HLOOKUP(\"Entitlements\",MasterSheet!B2:AQ31,MATCH(B7,MasterSheet!A3:A31,0)+1,FALSE)","v":"Work in Progress"},{"$f":"HLOOKUP(\"Misc\",MasterSheet!B2:AQ31,MATCH(B7,MasterSheet!A3:A31,0)+1,FALSE)","v":"Work in Progress"}]
[5,"Chhattisgarh",{"$f":"HLOOKUP(\"EWS Criterion\",MasterSheet!B2:AQ31,MATCH(B8,MasterSheet!A3:A31,0)+1,FALSE)","v":"Work in Progress"},{"$f":"HLOOKUP(\"Disadvantaged Group Criterion\",MasterSheet!B2:AQ31,MATCH(B8,MasterSheet!A3:A31,0)+1,FALSE)","v":"Work in Progress"},{"$f":"HLOOKUP(\"Pre-School Education\",MasterSheet!B2:AQ31,MATCH(B8,MasterSheet!A3:A31,0)+1,FALSE)","v":"Work in Progress"},{"$f":"HLOOKUP(\"Frequency of Calculation of\nPer-child Cost\",MasterSheet!B2:AQ31,MATCH(B8,MasterSheet!A3:A31,0)+1,FALSE)","v":"Work in Progress"},{"$f":"HLOOKUP(\"Per-child Cost per year in Rupees\",MasterSheet!B2:AQ31,MATCH(B8,MasterSheet!A3:A31,0)+1,FALSE)","v":"Work in Progress"},{"$f":"HLOOKUP(\"Document Proof for EWS/Disadvantaged\",MasterSheet!B2:AQ31,MATCH(B8,MasterSheet!A3:A31,0)+1,FALSE)","v":"Work in Progress"},{"$f":"HLOOKUP(\"Payment Schedule\",MasterSheet!B2:AQ31,MATCH(B8,MasterSheet!A3:A31,0)+1,FALSE)","v":"Work in Progress"},{"$f":"HLOOKUP(\"Payment Condition\",MasterSheet!B2:AQ31,MATCH(B8,MasterSheet!A3:A31,0)+1,FALSE)","v":"Work in Progress"},{"$f":"HLOOKUP(\"Neighbourhood Criterion\",MasterSheet!B2:AQ31,MATCH(B8,MasterSheet!A3:A31,0)+1,FALSE)","v":"Work in Progress"},{"$f":"HLOOKUP(\"Procedure of Admission\",MasterSheet!B2:AQ31,MATCH(B8,MasterSheet!A3:A31,0)+1,FALSE)","v":"Work in Progress"},{"$f":"HLOOKUP(\"Special Entitlements for Disabled\",MasterSheet!B2:AQ31,MATCH(B8,MasterSheet!A3:A31,0)+1,FALSE)","v":"Work in Progress"},{"$f":"HLOOKUP(\"Entitlements\",MasterSheet!B2:AQ31,MATCH(B8,MasterSheet!A3:A31,0)+1,FALSE)","v":"Work in Progress"},{"$f":"HLOOKUP(\"Misc\",MasterSheet!B2:AQ31,MATCH(B8,MasterSheet!A3:A31,0)+1,FALSE)","v":"Work in Progress"}]
{"$rows_left_out":25}
{"sheet":"Credits","index":4,"n_rows":18,"n_cols":3,"rows_kept":18,"cut":false,"hidden":true,"merged":[[7,1,7,5]]}
[]
[]
[]
[null,null,"CENTRE FOR CIVIL SOCIETY"]
[null,null,"Social Change Through Public Policy"]
[]
[]
[null,"Designed, Coded and Compiled By"]
{"$rows_left_out":10}